{"text_format":"1","workbook":"xlsx","n_sheets":2,"sheets":["Worksheet","SYSTEM FORMULAE"],"not_rendered":{"charts":0,"images":0,"macros":1,"external_links":0,"defined_names":2,"comments":0,"pivot_tables":0},"unopened":[],"bounds":{"document_bytes":16777216,"sheet_cells":100000,"rows_first":2000,"rows_last":500,"rows_between":2000,"halvings":0,"cell_chars":16384,"cell_head_chars":4096},"cells_cut":0,"cells_raw":0,"read":"whole","date_system":"1900"}

{"sheet":"Worksheet","index":0,"n_rows":16,"n_cols":40,"rows_kept":16,"cut":false,"hidden":false,"merged":[[1,0,1,1],[4,0,4,1],[0,2,0,39]]}
[null,null,{"$f":"CONCATENATE(\"Solve these \",IF(B6=1,\"equations\",IF(B6=2,\"inequations\",\"equations and inequations\")),\" without a calculator, giving your answer in its simplest form\")","v":"Solve these equations and inequations without a calculator, giving your answer in its simplest form"}]
["Variables",null,1,6,"p","–",7,">","–",70,"p",">","","21/2",null,16,20,"x","–",3,"≤","–",893,"x","≤","","89/2",null,31,16,"n","–",7,"=","–",765,"n","=","","379/8"]
["SHOW ANSWERS",false,2,5,"m","–",8,"=","",216,"m","=","","224/5",null,17,10,"q","–",15,"=","–",71,"q","=","","28/5",null,32,50,"e","–",17,"=","",348,"e","=","","73/10"]
["Number of questions (mimimum 15, maximum 45)",45,3,8,"n","+",20,"<","–",232,"n","<","","63/2",null,18,2,"x","+",6,"=","",63,"x","=","","57/2",null,33,8,"x","–",11,"=","",290,"x","=","","301/8"]
["Types of questions",null,4,6,"d","–",3,"=","",251,"d","=","","127/3",null,19,40,"s","–",3,"=","",1041,"s","=","","261/10",null,34,9,"z","–",14,"≤","–",209,"z","≤","","65/3"]
["Equations",3,5,8,"w","+",15,"=","",221,"w","=","","103/4",null,20,12,"j","+",12,"≥","",252,"j","≥","",20,null,35,14,"a","–",20,"=","–",524,"a","=","–",36]
["Inequations",1,6,8,"t","+",9,"=","",378,"t","=","","369/8",null,21,18,"j","+",9,">","–",31,"j",">","","20/9",null,36,25,"k","+",5,"<","",1255,"k","<","",50]
["Mixture of equations and inequations",1,7,5,"m","–",10,"=","",223,"m","=","","233/5",null,22,10,"k","–",9,"=","",255,"k","=","","132/5",null,37,10,"j","+",10,"=","",135,"j","=","","25/2"]
{"$rows_left_out":9}
{"sheet":"SYSTEM FORMULAE","index":1,"n_rows":15,"n_cols":68,"rows_kept":15,"cut":false,"hidden":false,"merged":[]}
[{"$f":"IF(ROW()<=Worksheet!$B$4/3,ROW(),\"\")","v":1},{"$f":"IF(OR(AO1=7,AO1=8,AO1=6,AO1=9),AO1*RANDBETWEEN(1,2),AO1*RANDBETWEEN(1,5))","v":12},{"$f":"CHOOSE(RANDBETWEEN(1,26),\"a\",\"b\",\"c\",\"d\",\"e\",\"f\",\"g\",\"h\",\"x\",\"j\",\"k\",\"x\",\"m\",\"n\",\"x\",\"p\",\"q\",\"r\",\"s\",\"t\",\"u\",\"v\",\"w\",\"x\",\"y\",\"z\")","v":"k"},{"$f":"IF(E1<0,\"–\",\"+\")","v":"+"},{"$f":"IF(Worksheet!$B$10,RANDBETWEEN(MAX(-20,-1*B1*AN1/AO1*(-1)^AP1),20),RANDBETWEEN(-20,20))","v":5},{"$f":"IF(Worksheet!$B$6=3,CHOOSE(RANDBETWEEN(1,2),\"=\",CHOOSE(RANDBETWEEN(1,4),\"<\",\">\",\"≥\",\"≤\")),IF(Worksheet!$B$6=2,CHOOSE(RANDBETWEEN(1,4),\"<\",\">\",\"≥\",\"≤\"),\"=\"))","v":"="},{"$f":"IF(H1<0,\"–\",\"\")","v":"–"},{"$f":"B1*AN1/AO1*(-1)^AP1+E1","v":-265},{"$f":"C1","v":"k"},{"$f":"F1","v":"="},{"$f":"IF(L1<0,\"–\",\"\")","v":""},{"$f":"IF(Worksheet!$B$10,IF(MOD(AN1,AO1)=0,AN1/AO1,TEXT(AN1/AO1,\"##/##\")),IF(MOD(AN1,AO1)=0,AN1/AO1*(-1)^AP1,TEXT(AN1/AO1*(-1)^AP1,\"##/##\")))","v":"-45/2"},null,{"$f":"MAX(A1:A50)+1","v":16},{"$f":"IF(OR(BB1=7,BB1=8,BB1=6,BB1=9),BB1*RANDBETWEEN(1,2),BB1*RANDBETWEEN(1,5))","v":20},{"$f":"CHOOSE(RANDBETWEEN(1,26),\"a\",\"b\",\"c\",\"d\",\"e\",\"f\",\"g\",\"h\",\"x\",\"j\",\"k\",\"x\",\"m\",\"n\",\"x\",\"p\",\"q\",\"r\",\"s\",\"t\",\"u\",\"v\",\"w\",\"x\",\"y\",\"z\")","v":"x"},{"$f":"IF(R1<0,\"–\",\"+\")","v":"+"},{"$f":"IF(Worksheet!$B$10,RANDBETWEEN(MAX(-20,-1*O1*BA1/BB1*(-1)^BC1),20),RANDBETWEEN(-20,20))","v":2},{"$f":"IF(Worksheet!$B$6=3,CHOOSE(RANDBETWEEN(1,2),\"=\",CHOOSE(RANDBETWEEN(1,4),\"<\",\">\",\"≥\",\"≤\")),IF(Worksheet!$B$6=2,CHOOSE(RANDBETWEEN(1,4),\"<\",\">\",\"≥\",\"≤\"),\"=\"))","v":"="},{"$f":"IF(U1<0,\"–\",\"\")","v":"–"},{"$f":"O1*BA1/BB1*(-1)^BC1+R1","v":-728},{"$f":"P1","v":"x"},{"$f":"S1","v":"="},{"$f":"IF(Y1<0,\"–\",\"\")","v":""},{"$f":"IF(Worksheet!$B$10,IF(MOD(BA1,BB1)=0,BA1/BB1,TEXT(BA1/BB1,\"##/##\")),IF(MOD(BA1,BB1)=0,BA1/BB1*(-1)^BC1,TEXT(BA1/BB1*(-1)^BC1,\"##/##\")))","v":"-73/2"},null,{"$f":"MAX(N1:N50)+1","v":31},{"$f":"IF(OR(BO1=7,BO1=8,BO1=6,BO1=9),BO1*RANDBETWEEN(1,2),BO1*RANDBETWEEN(1,5))","v":4},{"$f":"CHOOSE(RANDBETWEEN(1,26),\"a\",\"b\",\"c\",\"d\",\"e\",\"f\",\"g\",\"h\",\"x\",\"j\",\"k\",\"x\",\"m\",\"n\",\"x\",\"p\",\"q\",\"r\",\"s\",\"t\",\"u\",\"v\",\"w\",\"x\",\"y\",\"z\")","v":"c"},{"$f":"IF(AE1<0,\"–\",\"+\")","v":"–"},{"$f":"IF(Worksheet!$B$10,RANDBETWEEN(MAX(-20,-1*AB1*BN1/BO1*(-1)^BP1),20),RANDBETWEEN(-20,20))","v":-11},{"$f":"IF(Worksheet!$B$6=3,CHOOSE(RANDBETWEEN(1,2),\"=\",CHOOSE(RANDBETWEEN(1,4),\"<\",\">\",\"≥\",\"≤\")),IF(Worksheet!$B$6=2,CHOOSE(RANDBETWEEN(1,4),\"<\",\">\",\"≥\",\"≤\"),\"=\"))","v":"="},{"$f":"IF(AH1<0,\"–\",\"\")","v":""},{"$f":"AB1*BN1/BO1*(-1)^BP1+AE1","v":101},{"$f":"AC1","v":"c"},{"$f":"AF1","v":"="},{"$f":"IF(AL1<0,\"–\",\"\")","v":""},{"$f":"IF(Worksheet!$B$10,IF(MOD(BN1,BO1)=0,BN1/BO1,TEXT(BN1/BO1,\"##/##\")),IF(MOD(BN1,BO1)=0,BN1/BO1*(-1)^BP1,TEXT(BN1/BO1*(-1)^BP1,\"##/##\")))","v":28},null,{"$f":"RANDBETWEEN(1,Worksheet!$B$11*AO1)","v":135},{"$f":"RANDBETWEEN(2,10)","v":6},{"$f":"IF(Worksheet!$B$10,2,RANDBETWEEN(1,2))","v":1},null,null,null,null,null,null,null,null,null,null,{"$f":"RANDBETWEEN(1,Worksheet!$B$11*BB1)","v":146},{"$f":"RANDBETWEEN(2,10)","v":4},{"$f":"IF(Worksheet!$B$10,2,RANDBETWEEN(1,2))","v":1},null,null,null,null,null,null,null,null,null,null,{"$f":"RANDBETWEEN(1,Worksheet!$B$11*BO1)","v":56},{"$f":"RANDBETWEEN(2,10)","v":2},{"$f":"IF(Worksheet!$B$10,2,RANDBETWEEN(1,2))","v":2}]
[{"$f":"IF(ROW()<=Worksheet!$B$4/3,ROW(),\"\")","v":2},{"$f":"IF(OR(AO2=7,AO2=8,AO2=6,AO2=9),AO2*RANDBETWEEN(1,2),AO2*RANDBETWEEN(1,5))","v":9},{"$f":"CHOOSE(RANDBETWEEN(1,26),\"a\",\"b\",\"c\",\"d\",\"e\",\"f\",\"g\",\"h\",\"x\",\"j\",\"k\",\"x\",\"m\",\"n\",\"x\",\"p\",\"q\",\"r\",\"s\",\"t\",\"u\",\"v\",\"w\",\"x\",\"y\",\"z\")","v":"x"},{"$f":"IF(E2<0,\"–\",\"+\")","v":"+"},{"$f":"IF(Worksheet!$B$10,RANDBETWEEN(MAX(-20,-1*B2*AN2/AO2*(-1)^AP2),20),RANDBETWEEN(-20,20))","v":16},{"$f":"IF(Worksheet!$B$6=3,CHOOSE(RANDBETWEEN(1,2),\"=\",CHOOSE(RANDBETWEEN(1,4),\"<\",\">\",\"≥\",\"≤\")),IF(Worksheet!$B$6=2,CHOOSE(RANDBETWEEN(1,4),\"<\",\">\",\"≥\",\"≤\"),\"=\"))","v":"="},{"$f":"IF(H2<0,\"–\",\"\")","v":"–"},{"$f":"B2*AN2/AO2*(-1)^AP2+E2","v":-201},{"$f":"C2","v":"x"},{"$f":"F2","v":"="},{"$f":"IF(L2<0,\"–\",\"\")","v":""},{"$f":"IF(Worksheet!$B$10,IF(MOD(AN2,AO2)=0,AN2/AO2,TEXT(AN2/AO2,\"##/##\")),IF(MOD(AN2,AO2)=0,AN2/AO2*(-1)^AP2,TEXT(AN2/AO2*(-1)^AP2,\"##/##\")))","v":"-217/9"},null,{"$f":"IF(ROW()<=Worksheet!$B$4/3,N1+1,\"\")","v":17},{"$f":"IF(OR(BB2=7,BB2=8,BB2=6,BB2=9),BB2*RANDBETWEEN(1,2),BB2*RANDBETWEEN(1,5))","v":6},{"$f":"CHOOSE(RANDBETWEEN(1,26),\"a\",\"b\",\"c\",\"d\",\"e\",\"f\",\"g\",\"h\",\"x\",\"j\",\"k\",\"x\",\"m\",\"n\",\"x\",\"p\",\"q\",\"r\",\"s\",\"t\",\"u\",\"v\",\"w\",\"x\",\"y\",\"z\")","v":"x"},{"$f":"IF(R2<0,\"–\",\"+\")","v":"+"},{"$f":"IF(Worksheet!$B$10,RANDBETWEEN(MAX(-20,-1*O2*BA2/BB2*(-1)^BC2),20),RANDBETWEEN(-20,20))","v":7},{"$f":"IF(Worksheet!$B$6=3,CHOOSE(RANDBETWEEN(1,2),\"=\",CHOOSE(RANDBETWEEN(1,4),\"<\",\">\",\"≥\",\"≤\")),IF(Worksheet!$B$6=2,CHOOSE(RANDBETWEEN(1,4),\"<\",\">\",\"≥\",\"≤\"),\"=\"))","v":"="},{"$f":"IF(U2<0,\"–\",\"\")","v":""},{"$f":"O2*BA2/BB2*(-1)^BC2+R2","v":112},{"$f":"P2","v":"x"},{"$f":"S2","v":"="},{"$f":"IF(Y2<0,\"–\",\"\")","v":""},{"$f":"IF(Worksheet!$B$10,IF(MOD(BA2,BB2)=0,BA2/BB2,TEXT(BA2/BB2,\"##/##\")),IF(MOD(BA2,BB2)=0,BA2/BB2*(-1)^BC2,TEXT(BA2/BB2*(-1)^BC2,\"##/##\")))","v":"35/2"},null,{"$f":"IF(ROW()<=Worksheet!$B$4/3,AA1+1,\"\")","v":32},{"$f":"IF(OR(BO2=7,BO2=8,BO2=6,BO2=9),BO2*RANDBETWEEN(1,2),BO2*RANDBETWEEN(1,5))","v":6},{"$f":"CHOOSE(RANDBETWEEN(1,26),\"a\",\"b\",\"c\",\"d\",\"e\",\"f\",\"g\",\"h\",\"x\",\"j\",\"k\",\"x\",\"m\",\"n\",\"x\",\"p\",\"q\",\"r\",\"s\",\"t\",\"u\",\"v\",\"w\",\"x\",\"y\",\"z\")","v":"j"},{"$f":"IF(AE2<0,\"–\",\"+\")","v":"–"},{"$f":"IF(Worksheet!$B$10,RANDBETWEEN(MAX(-20,-1*AB2*BN2/BO2*(-1)^BP2),20),RANDBETWEEN(-20,20))","v":-11},{"$f":"IF(Worksheet!$B$6=3,CHOOSE(RANDBETWEEN(1,2),\"=\",CHOOSE(RANDBETWEEN(1,4),\"<\",\">\",\"≥\",\"≤\")),IF(Worksheet!$B$6=2,CHOOSE(RANDBETWEEN(1,4),\"<\",\">\",\"≥\",\"≤\"),\"=\"))","v":"<"},{"$f":"IF(AH2<0,\"–\",\"\")","v":"–"},{"$f":"AB2*BN2/BO2*(-1)^BP2+AE2","v":-217},{"$f":"AC2","v":"j"},{"$f":"AF2","v":"<"},{"$f":"IF(AL2<0,\"–\",\"\")","v":""},{"$f":"IF(Worksheet!$B$10,IF(MOD(BN2,BO2)=0,BN2/BO2,TEXT(BN2/BO2,\"##/##\")),IF(MOD(BN2,BO2)=0,BN2/BO2*(-1)^BP2,TEXT(BN2/BO2*(-1)^BP2,\"##/##\")))","v":"-103/3"},null,{"$f":"RANDBETWEEN(1,Worksheet!$B$11*AO2)","v":217},{"$f":"RANDBETWEEN(2,10)","v":9},{"$f":"IF(Worksheet!$B$10,2,RANDBETWEEN(1,2))","v":1},null,null,null,null,null,null,null,null,null,null,{"$f":"RANDBETWEEN(1,Worksheet!$B$11*BB2)","v":35},{"$f":"RANDBETWEEN(2,10)","v":2},{"$f":"IF(Worksheet!$B$10,2,RANDBETWEEN(1,2))","v":2},null,null,null,null,null,null,null,null,null,null,{"$f":"RANDBETWEEN(1,Worksheet!$B$11*BO2)","v":103},{"$f":"RANDBETWEEN(2,10)","v":3},{"$f":"IF(Worksheet!$B$10,2,RANDBETWEEN(1,2))","v":1}]
[{"$f":"IF(ROW()<=Worksheet!$B$4/3,ROW(),\"\")","v":3},16,"n","–",{"$f":"IF(Worksheet!$B$10,RANDBETWEEN(MAX(-20,-1*B3*AN3/AO3*(-1)^AP3),20),RANDBETWEEN(-20,20))","v":-5},{"$f":"IF(Worksheet!$B$6=3,CHOOSE(RANDBETWEEN(1,2),\"=\",CHOOSE(RANDBETWEEN(1,4),\"<\",\">\",\"≥\",\"≤\")),IF(Worksheet!$B$6=2,CHOOSE(RANDBETWEEN(1,4),\"<\",\">\",\"≥\",\"≤\"),\"=\"))","v":"<"},"–",-221,"n","<","",{"$f":"IF(Worksheet!$B$10,IF(MOD(AN3,AO3)=0,AN3/AO3,TEXT(AN3/AO3,\"##/##\")),IF(MOD(AN3,AO3)=0,AN3/AO3*(-1)^AP3,TEXT(AN3/AO3*(-1)^AP3,\"##/##\")))","v":"-27/2"},null,{"$f":"IF(ROW()<=Worksheet!$B$4/3,N2+1,\"\")","v":18},14,"w","–",{"$f":"IF(Worksheet!$B$10,RANDBETWEEN(MAX(-20,-1*O3*BA3/BB3*(-1)^BC3),20),RANDBETWEEN(-20,20))","v":-10},{"$f":"IF(Worksheet!$B$6=3,CHOOSE(RANDBETWEEN(1,2),\"=\",CHOOSE(RANDBETWEEN(1,4),\"<\",\">\",\"≥\",\"≤\")),IF(Worksheet!$B$6=2,CHOOSE(RANDBETWEEN(1,4),\"<\",\">\",\"≥\",\"≤\"),\"=\"))","v":">"},"",258,"w",">","",{"$f":"IF(Worksheet!$B$10,IF(MOD(BA3,BB3)=0,BA3/BB3,TEXT(BA3/BB3,\"##/##\")),IF(MOD(BA3,BB3)=0,BA3/BB3*(-1)^BC3,TEXT(BA3/BB3*(-1)^BC3,\"##/##\")))","v":"134/7"},null,{"$f":"IF(ROW()<=Worksheet!$B$4/3,AA2+1,\"\")","v":33},4,"g","–",{"$f":"IF(Worksheet!$B$10,RANDBETWEEN(MAX(-20,-1*AB3*BN3/BO3*(-1)^BP3),20),RANDBETWEEN(-20,20))","v":-5},{"$f":"IF(Worksheet!$B$6=3,CHOOSE(RANDBETWEEN(1,2),\"=\",CHOOSE(RANDBETWEEN(1,4),\"<\",\">\",\"≥\",\"≤\")),IF(Worksheet!$B$6=2,CHOOSE(RANDBETWEEN(1,4),\"<\",\">\",\"≥\",\"≤\"),\"=\"))","v":"<"},"–",-197,"g","<","–",{"$f":"IF(Worksheet!$B$10,IF(MOD(BN3,BO3)=0,BN3/BO3,TEXT(BN3/BO3,\"##/##\")),IF(MOD(BN3,BO3)=0,BN3/BO3*(-1)^BP3,TEXT(BN3/BO3*(-1)^BP3,\"##/##\")))","v":-48},null,{"$f":"RANDBETWEEN(1,Worksheet!$B$11*AO3)","v":54},4,{"$f":"IF(Worksheet!$B$10,2,RANDBETWEEN(1,2))","v":1},null,null,null,null,null,null,null,null,null,null,{"$f":"RANDBETWEEN(1,Worksheet!$B$11*BB3)","v":134},7,{"$f":"IF(Worksheet!$B$10,2,RANDBETWEEN(1,2))","v":2},null,null,null,null,null,null,null,null,null,null,{"$f":"RANDBETWEEN(1,Worksheet!$B$11*BO3)","v":192},4,{"$f":"IF(Worksheet!$B$10,2,RANDBETWEEN(1,2))","v":1}]
[{"$f":"IF(ROW()<=Worksheet!$B$4/3,ROW(),\"\")","v":4},6,"x","+",{"$f":"IF(Worksheet!$B$10,RANDBETWEEN(MAX(-20,-1*B4*AN4/AO4*(-1)^AP4),20),RANDBETWEEN(-20,20))","v":18},{"$f":"IF(Worksheet!$B$6=3,CHOOSE(RANDBETWEEN(1,2),\"=\",CHOOSE(RANDBETWEEN(1,4),\"<\",\">\",\"≥\",\"≤\")),IF(Worksheet!$B$6=2,CHOOSE(RANDBETWEEN(1,4),\"<\",\">\",\"≥\",\"≤\"),\"=\"))","v":"≤"},"",315,"x","≤","",{"$f":"IF(Worksheet!$B$10,IF(MOD(AN4,AO4)=0,AN4/AO4,TEXT(AN4/AO4,\"##/##\")),IF(MOD(AN4,AO4)=0,AN4/AO4*(-1)^AP4,TEXT(AN4/AO4*(-1)^AP4,\"##/##\")))","v":"99/2"},null,{"$f":"IF(ROW()<=Worksheet!$B$4/3,N3+1,\"\")","v":19},5,"t","+",{"$f":"IF(Worksheet!$B$10,RANDBETWEEN(MAX(-20,-1*O4*BA4/BB4*(-1)^BC4),20),RANDBETWEEN(-20,20))","v":5},{"$f":"IF(Worksheet!$B$6=3,CHOOSE(RANDBETWEEN(1,2),\"=\",CHOOSE(RANDBETWEEN(1,4),\"<\",\">\",\"≥\",\"≤\")),IF(Worksheet!$B$6=2,CHOOSE(RANDBETWEEN(1,4),\"<\",\">\",\"≥\",\"≤\"),\"=\"))","v":"="},"–",-40,"t","=","–",{"$f":"IF(Worksheet!$B$10,IF(MOD(BA4,BB4)=0,BA4/BB4,TEXT(BA4/BB4,\"##/##\")),IF(MOD(BA4,BB4)=0,BA4/BB4*(-1)^BC4,TEXT(BA4/BB4*(-1)^BC4,\"##/##\")))","v":-9},null,{"$f":"IF(ROW()<=Worksheet!$B$4/3,AA3+1,\"\")","v":34},20,"c","+",{"$f":"IF(Worksheet!$B$10,RANDBETWEEN(MAX(-20,-1*AB4*BN4/BO4*(-1)^BP4),20),RANDBETWEEN(-20,20))","v":11},{"$f":"IF(Worksheet!$B$6=3,CHOOSE(RANDBETWEEN(1,2),\"=\",CHOOSE(RANDBETWEEN(1,4),\"<\",\">\",\"≥\",\"≤\")),IF(Worksheet!$B$6=2,CHOOSE(RANDBETWEEN(1,4),\"<\",\">\",\"≥\",\"≤\"),\"=\"))","v":"="},"–",-49,"c","=","–",{"$f":"IF(Worksheet!$B$10,IF(MOD(BN4,BO4)=0,BN4/BO4,TEXT(BN4/BO4,\"##/##\")),IF(MOD(BN4,BO4)=0,BN4/BO4*(-1)^BP4,TEXT(BN4/BO4*(-1)^BP4,\"##/##\")))","v":-3},null,{"$f":"RANDBETWEEN(1,Worksheet!$B$11*AO4)","v":297},6,{"$f":"IF(Worksheet!$B$10,2,RANDBETWEEN(1,2))","v":2},null,null,null,null,null,null,null,null,null,null,{"$f":"RANDBETWEEN(1,Worksheet!$B$11*BB4)","v":45},5,{"$f":"IF(Worksheet!$B$10,2,RANDBETWEEN(1,2))","v":1},null,null,null,null,null,null,null,null,null,null,{"$f":"RANDBETWEEN(1,Worksheet!$B$11*BO4)","v":15},5,{"$f":"IF(Worksheet!$B$10,2,RANDBETWEEN(1,2))","v":1}]
[{"$f":"IF(ROW()<=Worksheet!$B$4/3,ROW(),\"\")","v":5},4,"h","+",{"$f":"IF(Worksheet!$B$10,RANDBETWEEN(MAX(-20,-1*B5*AN5/AO5*(-1)^AP5),20),RANDBETWEEN(-20,20))","v":19},{"$f":"IF(Worksheet!$B$6=3,CHOOSE(RANDBETWEEN(1,2),\"=\",CHOOSE(RANDBETWEEN(1,4),\"<\",\">\",\"≥\",\"≤\")),IF(Worksheet!$B$6=2,CHOOSE(RANDBETWEEN(1,4),\"<\",\">\",\"≥\",\"≤\"),\"=\"))","v":">"},"",67,"h",">","",{"$f":"IF(Worksheet!$B$10,IF(MOD(AN5,AO5)=0,AN5/AO5,TEXT(AN5/AO5,\"##/##\")),IF(MOD(AN5,AO5)=0,AN5/AO5*(-1)^AP5,TEXT(AN5/AO5*(-1)^AP5,\"##/##\")))","v":12},null,{"$f":"IF(ROW()<=Worksheet!$B$4/3,N4+1,\"\")","v":20},7,"v","+",{"$f":"IF(Worksheet!$B$10,RANDBETWEEN(MAX(-20,-1*O5*BA5/BB5*(-1)^BC5),20),RANDBETWEEN(-20,20))","v":15},{"$f":"IF(Worksheet!$B$6=3,CHOOSE(RANDBETWEEN(1,2),\"=\",CHOOSE(RANDBETWEEN(1,4),\"<\",\">\",\"≥\",\"≤\")),IF(Worksheet!$B$6=2,CHOOSE(RANDBETWEEN(1,4),\"<\",\">\",\"≥\",\"≤\"),\"=\"))","v":"≥"},"",16,"v","≥","",{"$f":"IF(Worksheet!$B$10,IF(MOD(BA5,BB5)=0,BA5/BB5,TEXT(BA5/BB5,\"##/##\")),IF(MOD(BA5,BB5)=0,BA5/BB5*(-1)^BC5,TEXT(BA5/BB5*(-1)^BC5,\"##/##\")))","v":"1/7"},null,{"$f":"IF(ROW()<=Worksheet!$B$4/3,AA4+1,\"\")","v":35},2,"g","–",{"$f":"IF(Worksheet!$B$10,RANDBETWEEN(MAX(-20,-1*AB5*BN5/BO5*(-1)^BP5),20),RANDBETWEEN(-20,20))","v":-4},{"$f":"IF(Worksheet!$B$6=3,CHOOSE(RANDBETWEEN(1,2),\"=\",CHOOSE(RANDBETWEEN(1,4),\"<\",\">\",\"≥\",\"≤\")),IF(Worksheet!$B$6=2,CHOOSE(RANDBETWEEN(1,4),\"<\",\">\",\"≥\",\"≤\"),\"=\"))","v":">"},"–",-16,"g",">","–",{"$f":"IF(Worksheet!$B$10,IF(MOD(BN5,BO5)=0,BN5/BO5,TEXT(BN5/BO5,\"##/##\")),IF(MOD(BN5,BO5)=0,BN5/BO5*(-1)^BP5,TEXT(BN5/BO5*(-1)^BP5,\"##/##\")))","v":-6},null,{"$f":"RANDBETWEEN(1,Worksheet!$B$11*AO5)","v":24},2,{"$f":"IF(Worksheet!$B$10,2,RANDBETWEEN(1,2))","v":2},null,null,null,null,null,null,null,null,null,null,{"$f":"RANDBETWEEN(1,Worksheet!$B$11*BB5)","v":1},7,{"$f":"IF(Worksheet!$B$10,2,RANDBETWEEN(1,2))","v":2},null,null,null,null,null,null,null,null,null,null,{"$f":"RANDBETWEEN(1,Worksheet!$B$11*BO5)","v":12},2,{"$f":"IF(Worksheet!$B$10,2,RANDBETWEEN(1,2))","v":1}]
[{"$f":"IF(ROW()<=Worksheet!$B$4/3,ROW(),\"\")","v":6},8,"d","–",{"$f":"IF(Worksheet!$B$10,RANDBETWEEN(MAX(-20,-1*B6*AN6/AO6*(-1)^AP6),20),RANDBETWEEN(-20,20))","v":-3},{"$f":"IF(Worksheet!$B$6=3,CHOOSE(RANDBETWEEN(1,2),\"=\",CHOOSE(RANDBETWEEN(1,4),\"<\",\">\",\"≥\",\"≤\")),IF(Worksheet!$B$6=2,CHOOSE(RANDBETWEEN(1,4),\"<\",\">\",\"≥\",\"≤\"),\"=\"))","v":"≤"},"–",-208,"d","≤","",{"$f":"IF(Worksheet!$B$10,IF(MOD(AN6,AO6)=0,AN6/AO6,TEXT(AN6/AO6,\"##/##\")),IF(MOD(AN6,AO6)=0,AN6/AO6*(-1)^AP6,TEXT(AN6/AO6*(-1)^AP6,\"##/##\")))","v":"-205/8"},null,{"$f":"IF(ROW()<=Worksheet!$B$4/3,N5+1,\"\")","v":21},16,"g","–",{"$f":"IF(Worksheet!$B$10,RANDBETWEEN(MAX(-20,-1*O6*BA6/BB6*(-1)^BC6),20),RANDBETWEEN(-20,20))","v":-11},{"$f":"IF(Worksheet!$B$6=3,CHOOSE(RANDBETWEEN(1,2),\"=\",CHOOSE(RANDBETWEEN(1,4),\"<\",\">\",\"≥\",\"≤\")),IF(Worksheet!$B$6=2,CHOOSE(RANDBETWEEN(1,4),\"<\",\">\",\"≥\",\"≤\"),\"=\"))","v":">"},"",253,"g",">","",{"$f":"IF(Worksheet!$B$10,IF(MOD(BA6,BB6)=0,BA6/BB6,TEXT(BA6/BB6,\"##/##\")),IF(MOD(BA6,BB6)=0,BA6/BB6*(-1)^BC6,TEXT(BA6/BB6*(-1)^BC6,\"##/##\")))","v":"33/2"},null,{"$f":"IF(ROW()<=Worksheet!$B$4/3,AA5+1,\"\")","v":36},6,"w","+",{"$f":"IF(Worksheet!$B$10,RANDBETWEEN(MAX(-20,-1*AB6*BN6/BO6*(-1)^BP6),20),RANDBETWEEN(-20,20))","v":12},{"$f":"IF(Worksheet!$B$6=3,CHOOSE(RANDBETWEEN(1,2),\"=\",CHOOSE(RANDBETWEEN(1,4),\"<\",\">\",\"≥\",\"≤\")),IF(Worksheet!$B$6=2,CHOOSE(RANDBETWEEN(1,4),\"<\",\">\",\"≥\",\"≤\"),\"=\"))","v":">"},"–",-242,"w",">","",{"$f":"IF(Worksheet!$B$10,IF(MOD(BN6,BO6)=0,BN6/BO6,TEXT(BN6/BO6,\"##/##\")),IF(MOD(BN6,BO6)=0,BN6/BO6*(-1)^BP6,TEXT(BN6/BO6*(-1)^BP6,\"##/##\")))","v":"-127/3"},null,{"$f":"RANDBETWEEN(1,Worksheet!$B$11*AO6)","v":205},8,{"$f":"IF(Worksheet!$B$10,2,RANDBETWEEN(1,2))","v":1},null,null,null,null,null,null,null,null,null,null,{"$f":"RANDBETWEEN(1,Worksheet!$B$11*BB6)","v":66},4,{"$f":"IF(Worksheet!$B$10,2,RANDBETWEEN(1,2))","v":2},null,null,null,null,null,null,null,null,null,null,{"$f":"RANDBETWEEN(1,Worksheet!$B$11*BO6)","v":254},6,{"$f":"IF(Worksheet!$B$10,2,RANDBETWEEN(1,2))","v":1}]
[{"$f":"IF(ROW()<=Worksheet!$B$4/3,ROW(),\"\")","v":7},12,"x","–",{"$f":"IF(Worksheet!$B$10,RANDBETWEEN(MAX(-20,-1*B7*AN7/AO7*(-1)^AP7),20),RANDBETWEEN(-20,20))","v":-1},{"$f":"IF(Worksheet!$B$6=3,CHOOSE(RANDBETWEEN(1,2),\"=\",CHOOSE(RANDBETWEEN(1,4),\"<\",\">\",\"≥\",\"≤\")),IF(Worksheet!$B$6=2,CHOOSE(RANDBETWEEN(1,4),\"<\",\">\",\"≥\",\"≤\"),\"=\"))","v":"<"},"",209,"x","<","",{"$f":"IF(Worksheet!$B$10,IF(MOD(AN7,AO7)=0,AN7/AO7,TEXT(AN7/AO7,\"##/##\")),IF(MOD(AN7,AO7)=0,AN7/AO7*(-1)^AP7,TEXT(AN7/AO7*(-1)^AP7,\"##/##\")))","v":"35/2"},null,{"$f":"IF(ROW()<=Worksheet!$B$4/3,N6+1,\"\")","v":22},16,"f","+",{"$f":"IF(Worksheet!$B$10,RANDBETWEEN(MAX(-20,-1*O7*BA7/BB7*(-1)^BC7),20),RANDBETWEEN(-20,20))","v":11},{"$f":"IF(Worksheet!$B$6=3,CHOOSE(RANDBETWEEN(1,2),\"=\",CHOOSE(RANDBETWEEN(1,4),\"<\",\">\",\"≥\",\"≤\")),IF(Worksheet!$B$6=2,CHOOSE(RANDBETWEEN(1,4),\"<\",\">\",\"≥\",\"≤\"),\"=\"))","v":"="},"–",-131,"f","=","",{"$f":"IF(Worksheet!$B$10,IF(MOD(BA7,BB7)=0,BA7/BB7,TEXT(BA7/BB7,\"##/##\")),IF(MOD(BA7,BB7)=0,BA7/BB7*(-1)^BC7,TEXT(BA7/BB7*(-1)^BC7,\"##/##\")))","v":"-71/8"},null,{"$f":"IF(ROW()<=Worksheet!$B$4/3,AA6+1,\"\")","v":37},4,"z","+",{"$f":"IF(Worksheet!$B$10,RANDBETWEEN(MAX(-20,-1*AB7*BN7/BO7*(-1)^BP7),20),RANDBETWEEN(-20,20))","v":13},{"$f":"IF(Worksheet!$B$6=3,CHOOSE(RANDBETWEEN(1,2),\"=\",CHOOSE(RANDBETWEEN(1,4),\"<\",\">\",\"≥\",\"≤\")),IF(Worksheet!$B$6=2,CHOOSE(RANDBETWEEN(1,4),\"<\",\">\",\"≥\",\"≤\"),\"=\"))","v":"≤"},"",88,"z","≤","",{"$f":"IF(Worksheet!$B$10,IF(MOD(BN7,BO7)=0,BN7/BO7,TEXT(BN7/BO7,\"##/##\")),IF(MOD(BN7,BO7)=0,BN7/BO7*(-1)^BP7,TEXT(BN7/BO7*(-1)^BP7,\"##/##\")))","v":"75/4"},null,{"$f":"RANDBETWEEN(1,Worksheet!$B$11*AO7)","v":70},4,{"$f":"IF(Worksheet!$B$10,2,RANDBETWEEN(1,2))","v":2},null,null,null,null,null,null,null,null,null,null,{"$f":"RANDBETWEEN(1,Worksheet!$B$11*BB7)","v":71},8,{"$f":"IF(Worksheet!$B$10,2,RANDBETWEEN(1,2))","v":1},null,null,null,null,null,null,null,null,null,null,{"$f":"RANDBETWEEN(1,Worksheet!$B$11*BO7)","v":75},4,{"$f":"IF(Worksheet!$B$10,2,RANDBETWEEN(1,2))","v":2}]
[{"$f":"IF(ROW()<=Worksheet!$B$4/3,ROW(),\"\")","v":8},20,"s","+",{"$f":"IF(Worksheet!$B$10,RANDBETWEEN(MAX(-20,-1*B8*AN8/AO8*(-1)^AP8),20),RANDBETWEEN(-20,20))","v":13},{"$f":"IF(Worksheet!$B$6=3,CHOOSE(RANDBETWEEN(1,2),\"=\",CHOOSE(RANDBETWEEN(1,4),\"<\",\">\",\"≥\",\"≤\")),IF(Worksheet!$B$6=2,CHOOSE(RANDBETWEEN(1,4),\"<\",\">\",\"≥\",\"≤\"),\"=\"))","v":"="},"",913,"s","=","",{"$f":"IF(Worksheet!$B$10,IF(MOD(AN8,AO8)=0,AN8/AO8,TEXT(AN8/AO8,\"##/##\")),IF(MOD(AN8,AO8)=0,AN8/AO8*(-1)^AP8,TEXT(AN8/AO8*(-1)^AP8,\"##/##\")))","v":45},null,{"$f":"IF(ROW()<=Worksheet!$B$4/3,N7+1,\"\")","v":23},50,"c","+",{"$f":"IF(Worksheet!$B$10,RANDBETWEEN(MAX(-20,-1*O8*BA8/BB8*(-1)^BC8),20),RANDBETWEEN(-20,20))","v":8},{"$f":"IF(Worksheet!$B$6=3,CHOOSE(RANDBETWEEN(1,2),\"=\",CHOOSE(RANDBETWEEN(1,4),\"<\",\">\",\"≥\",\"≤\")),IF(Worksheet!$B$6=2,CHOOSE(RANDBETWEEN(1,4),\"<\",\">\",\"≥\",\"≤\"),\"=\"))","v":"≥"},"–",-237,"c","≥","",{"$f":"IF(Worksheet!$B$10,IF(MOD(BA8,BB8)=0,BA8/BB8,TEXT(BA8/BB8,\"##/##\")),IF(MOD(BA8,BB8)=0,BA8/BB8*(-1)^BC8,TEXT(BA8/BB8*(-1)^BC8,\"##/##\")))","v":"-49/10"},null,{"$f":"IF(ROW()<=Worksheet!$B$4/3,AA7+1,\"\")","v":38},9,"d","+",{"$f":"IF(Worksheet!$B$10,RANDBETWEEN(MAX(-20,-1*AB8*BN8/BO8*(-1)^BP8),20),RANDBETWEEN(-20,20))","v":1},{"$f":"IF(Worksheet!$B$6=3,CHOOSE(RANDBETWEEN(1,2),\"=\",CHOOSE(RANDBETWEEN(1,4),\"<\",\">\",\"≥\",\"≤\")),IF(Worksheet!$B$6=2,CHOOSE(RANDBETWEEN(1,4),\"<\",\">\",\"≥\",\"≤\"),\"=\"))","v":">"},"",364,"d",">","",{"$f":"IF(Worksheet!$B$10,IF(MOD(BN8,BO8)=0,BN8/BO8,TEXT(BN8/BO8,\"##/##\")),IF(MOD(BN8,BO8)=0,BN8/BO8*(-1)^BP8,TEXT(BN8/BO8*(-1)^BP8,\"##/##\")))","v":"121/3"},null,{"$f":"RANDBETWEEN(1,Worksheet!$B$11*AO8)","v":225},5,{"$f":"IF(Worksheet!$B$10,2,RANDBETWEEN(1,2))","v":2},null,null,null,null,null,null,null,null,null,null,{"$f":"RANDBETWEEN(1,Worksheet!$B$11*BB8)","v":49},10,{"$f":"IF(Worksheet!$B$10,2,RANDBETWEEN(1,2))","v":1},null,null,null,null,null,null,null,null,null,null,{"$f":"RANDBETWEEN(1,Worksheet!$B$11*BO8)","v":363},9,{"$f":"IF(Worksheet!$B$10,2,RANDBETWEEN(1,2))","v":2}]
{"$rows_left_out":7}